BDBM50098438 CHEMBL3593581
SMILES CC1CCCC(C1)n1c2c(cnc3[nH]ccc23)[nH]c1=O
InChI Key InChIKey=PEYSACCOFLQEMD-UHFFFAOYSA-N
Data  3 IC50
  Tab Delimited (TSV)   2D SDfile   Computed 3D by Vconf -m prep SDfile
Find this compound or compounds like it in BindingDB:
Activity Spreadsheet -- Enzyme Inhibition Constant Data from BindingDB
Found 3 hits for monomerid = 50098438
TargetTyrosine-protein kinase JAK1(Homo sapiens (Human))
Astellas Pharma
Curated by ChEMBL
LigandPNGBDBM50098438(CHEMBL3593581)
Affinity DataIC50:  430nM. Assay description: Inhibition of human JAK1 kinase domain using biotin-Lyn-substrate-2 as substrate and ATP incubated for 1 hr by ELISA method
In DepthDetails ArticlePubMed
TargetTyrosine-protein kinase JAK2(Homo sapiens (Human))
Astellas Pharma
Curated by ChEMBL
LigandPNGBDBM50098438(CHEMBL3593581)
Affinity DataIC50:  23nM. Assay description: Inhibition of human JAK2 kinase domain using biotin-Lyn-substrate-2 as substrate and ATP incubated for 1 hr by ELISA method
In DepthDetails ArticlePubMed
TargetTyrosine-protein kinase JAK3(Homo sapiens (Human))
Astellas Pharma
Curated by ChEMBL
LigandPNGBDBM50098438(CHEMBL3593581)
Affinity DataIC50:  21nM. Assay description: Inhibition of human JAK3 kinase domain using biotin-Lyn-substrate-2 as substrate and ATP incubated for 1 hr by ELISA method
In DepthDetails ArticlePubMed