BDBM50098574 CHEMBL409896::phenylbutyryl-Tyr-Ser-Lys-2-Nal-Leu-Asp-Ser-Arg-Arg-Ala-Gln-Asp-Phe-Val-Gln-Trp-Leu-Met-Asn-Thr-NH2
SMILES CSCC[C@H](NC(=O)[C@H](CC(C)C)NC(=O)[C@H](Cc1c[nH]c2ccccc12)NC(=O)[C@H](CCC(N)=O)NC(=O)[C@@H](NC(=O)[C@H](Cc1ccccc1)NC(=O)[C@H](CC(O)=O)NC(=O)[C@H](CCC(N)=O)NC(=O)[C@H](C)NC(=O)[C@H](CCCNC(N)=N)NC(=O)[C@H](CCCNC(N)=N)NC(=O)[C@H](CO)NC(=O)[C@H](CC(O)=O)NC(=O)[C@H](CC(C)C)NC(=O)[C@H](Cc1ccc2ccccc2c1)NC(=O)[C@H](CCCCN)NC(=O)[C@H](CO)NC(=O)[C@H](Cc1ccc(O)cc1)NC(=O)CCCc1ccccc1)C(C)C)C(=O)N[C@@H](CC(N)=O)C(=O)N[C@@H]([C@@H](C)O)C(N)=O
InChI Key InChIKey=DCRYTZBMARURHD-YILASRLDSA-N
Data  1 IC50
  Tab Delimited (TSV)   2D SDfile   Computed 3D by Vconf -m prep SDfile
Find this compound or compounds like it in BindingDB:
Activity Spreadsheet -- Enzyme Inhibition Constant Data from BindingDB
Found 1 hit for monomerid = 50098574
TargetGlucagon receptor(Rattus norvegicus)
University Of Arizona
Curated by ChEMBL
LigandPNGBDBM50098574(CHEMBL409896 | phenylbutyryl-Tyr-Ser-Lys-2-Nal-Leu...)
Affinity DataIC50:  781nM. Assay description: IC50 value of the compound was expressed for inhibition of [125]glucagon specific binding.
In DepthDetails ArticlePubMed