BDBM50098616 10-(4-Amino-butyl)-19-(2-amino-3-phenyl-propionylamino)-16-benzyl-7-(1-hydroxy-ethyl)-13-(1H-indol-3-ylmethyl)-11-methyl-6,9,12,15,18-pentaoxo-1,2-dithia-5,8,11,14,17-pentaaza-cycloicosane-4-carboxylic acid (1-carbamoyl-2-hydroxy-propyl)-amide::CHEMBL412466
SMILES C[C@@H](O)[C@H](NC(=O)[C@@H]1CSSC[C@@H](NC(=O)[C@H](N)Cc2ccccc2)C(=O)N[C@@H](Cc2ccccc2)C(=O)N[C@@H](Cc2c[nH]c3ccccc23)C(=O)N(C)[C@@H](CCCCN)C(=O)N[C@@H]([C@@H](C)O)C(=O)N1)C(N)=O
InChI Key InChIKey=HMXVKJKGTQRUOL-JDBXKHNRSA-N
Data  5 Kd
  Tab Delimited (TSV)   2D SDfile   Computed 3D by Vconf -m prep SDfile
Find this compound or compounds like it in BindingDB:
Activity Spreadsheet -- Enzyme Inhibition Constant Data from BindingDB
Found 5 hits for monomerid = 50098616
TargetSomatostatin receptor type 2(Homo sapiens (Human))
Tulane University Health Sciences Center
Curated by ChEMBL
LigandPNGBDBM50098616(10-(4-Amino-butyl)-19-(2-amino-3-phenyl-propionyla...)
Affinity DataKd:  1.84nM. Assay description: Binding affinity was determined on cloned human somatostatin receptor-1 (hsst2)
In DepthDetails ArticlePubMed
TargetSomatostatin receptor type 1(Homo sapiens (Human))
Tulane University Health Sciences Center
Curated by ChEMBL
LigandPNGBDBM50098616(10-(4-Amino-butyl)-19-(2-amino-3-phenyl-propionyla...)
Affinity DataKd:  867nM. Assay description: Binding affinity was determined on cloned human somatostatin receptor-1 (hsst1)
In DepthDetails ArticlePubMed
TargetSomatostatin receptor type 4(Homo sapiens (Human))
Tulane University Health Sciences Center
Curated by ChEMBL
LigandPNGBDBM50098616(10-(4-Amino-butyl)-19-(2-amino-3-phenyl-propionyla...)
Affinity DataKd: >1.00E+3nM. Assay description: Binding affinity was determined on cloned human somatostatin receptor-1 (hsst4)
In DepthDetails ArticlePubMed
TargetSomatostatin receptor type 5(Homo sapiens (Human))
Tulane University Health Sciences Center
Curated by ChEMBL
LigandPNGBDBM50098616(10-(4-Amino-butyl)-19-(2-amino-3-phenyl-propionyla...)
Affinity DataKd:  8.41nM. Assay description: Binding affinity was determined on cloned human somatostatin receptor-1 (hsst5)
In DepthDetails ArticlePubMed
TargetSomatostatin receptor type 3(Homo sapiens (Human))
Tulane University Health Sciences Center
Curated by ChEMBL
LigandPNGBDBM50098616(10-(4-Amino-butyl)-19-(2-amino-3-phenyl-propionyla...)
Affinity DataKd:  67.5nM. Assay description: Binding affinity was determined on cloned human somatostatin receptor-1 (hsst3)
In DepthDetails ArticlePubMed