BDBM50098630 1-Cyclooctylmethyl-4-[(2,7-dichloro-9H-xanthene-9-carbonyl)-amino]-1-methyl-piperidinium; iodide::CHEMBL33929
SMILES C[N+]1(CC2CCCCCCC2)CCC(CC1)NC(=O)C1c2cc(Cl)ccc2Oc2ccc(Cl)cc12
InChI Key InChIKey=GAWADCCAEQQLNX-UHFFFAOYSA-O
Data  2 IC50
  Tab Delimited (TSV)   2D SDfile   Computed 3D by Vconf -m prep SDfile
Find this compound or compounds like it in BindingDB:
Activity Spreadsheet -- Enzyme Inhibition Constant Data from BindingDB
Found 2 hits for monomerid = 50098630
TargetC-C chemokine receptor type 1(Homo sapiens (Human))
Banyu Tsukuba Research Institute In Collaboration With Merck Research Laboratories
Curated by ChEMBL
LigandPNGBDBM50098630(1-Cyclooctylmethyl-4-[(2,7-dichloro-9H-xanthene-9-...)
Affinity DataIC50:  17nM. Assay description: Inhibitory activity against [125I]-MIP-1 alpha binding to human CCR1 receptors.
In DepthDetails ArticlePubMed
TargetC-C chemokine receptor type 1(Mus musculus)
Banyu Tsukuba Research Institute In Collaboration With Merck Research Laboratories
Curated by ChEMBL
LigandPNGBDBM50098630(1-Cyclooctylmethyl-4-[(2,7-dichloro-9H-xanthene-9-...)
Affinity DataIC50:  710nM. Assay description: Inhibitory activity against [125I]-MIP-1 alpha binding to mouse CCR1 receptors.
In DepthDetails ArticlePubMed