BDBM50098662 2-(4-{4-[2-Hydroxy-2-(4-hydroxy-3-methanesulfonylamino-phenyl)-ethylamino]-piperidin-1-yl}-benzoylamino)-3-phenyl-propionic acid::CHEMBL32599
SMILES CS(=O)(=O)Nc1cc(ccc1O)[C@@H](O)CNC1CCN(CC1)c1ccc(cc1)C(=O)N[C@@H](Cc1ccccc1)C(O)=O
InChI Key InChIKey=WJZRAVQJGGLRCV-XCZPVHLTSA-N
Data  2 KI  3 EC50
  Tab Delimited (TSV)   2D SDfile   Computed 3D by Vconf -m prep SDfile
Find this compound or compounds like it in BindingDB:
Activity Spreadsheet -- Enzyme Inhibition Constant Data from BindingDB
Found 5 hits for monomerid = 50098662
TargetBeta-2 adrenergic receptor(Homo sapiens (Human))
Wyeth-Ayerst Research
Curated by ChEMBL
LigandPNGBDBM50098662(2-(4-{4-[2-Hydroxy-2-(4-hydroxy-3-methanesulfonyla...)
Affinity DataKi:  480nM. Assay description: Inhibition of I-iodocyanopindolol binding to human beta 2 adrenergic receptors
In DepthDetails ArticlePubMed
TargetBeta-1 adrenergic receptor(Homo sapiens (Human))
Wyeth-Ayerst Research
Curated by ChEMBL
LigandPNGBDBM50098662(2-(4-{4-[2-Hydroxy-2-(4-hydroxy-3-methanesulfonyla...)
Affinity DataKi: >1.00E+5nM. Assay description: Inhibition of I-iodocyanopindolol binding to human beta 1 adrenergic receptors
In DepthDetails ArticlePubMed
TargetBeta-3 adrenergic receptor(Homo sapiens (Human))
Wyeth-Ayerst Research
Curated by ChEMBL
LigandPNGBDBM50098662(2-(4-{4-[2-Hydroxy-2-(4-hydroxy-3-methanesulfonyla...)
Affinity DataEC50:  4nM. Assay description: In vitro increase in cAMP levels in Chinese hamster ovary cells expressing the human cloned beta 3 Adrenergic receptor.
In DepthDetails ArticlePubMed
TargetBeta-1 adrenergic receptor(Homo sapiens (Human))
Wyeth-Ayerst Research
Curated by ChEMBL
LigandPNGBDBM50098662(2-(4-{4-[2-Hydroxy-2-(4-hydroxy-3-methanesulfonyla...)
Affinity DataEC50:  4.37E+4nM. Assay description: In vitro activity to increase cAMP levels in Chinese hamster ovary (CHO) cells expressing the cloned human beta 1 Adrenergic receptor
In DepthDetails ArticlePubMed
TargetBeta-2 adrenergic receptor(Homo sapiens (Human))
Wyeth-Ayerst Research
Curated by ChEMBL
LigandPNGBDBM50098662(2-(4-{4-[2-Hydroxy-2-(4-hydroxy-3-methanesulfonyla...)
Affinity DataEC50:  1.50E+3nM. Assay description: Increased cAMP levels of Chinese hamster ovary (CHO) cells expressing human beta 2 adrenergic receptors
In DepthDetails ArticlePubMed