BDBM50098729 CHEMBL3594317
SMILES CC(C)(C)c1cc(no1)C(=O)C(=N\Nc1ccccc1Cl)\C#N
InChI Key InChIKey=MLEIAPIKRLXYAB-DEDYPNTBSA-N
Data  1 IC50
  Tab Delimited (TSV)   2D SDfile   Computed 3D by Vconf -m prep SDfile
Find this compound or compounds like it in BindingDB:
Activity Spreadsheet -- Enzyme Inhibition Constant Data from BindingDB
Found 1 hit for monomerid = 50098729
TargetRap guanine nucleotide exchange factor 4(Mus musculus)
University Of Texas Medical Branch
Curated by ChEMBL
LigandPNGBDBM50098729(CHEMBL3594317)
Affinity DataIC50:  2.83E+4nM. Assay description: Displacement of 8-NBD-cAMP from mouse recombinant EPAC2 by fluorescence assay
In DepthDetails ArticlePubMed