BDBM50099062 CHEMBL3344081::US10730870, Example 3::US11512083, Example 3
SMILES CC(=O)N[C@H](C(=O)N1C[C@H](O)C[C@H]1C(=O)NCc1ccc(cc1)-c1scnc1C)C(C)(C)C
InChI Key InChIKey=GFVIEZBZIUKYOG-SVFBPWRDSA-N
Data  8 IC50  7 Kd
PDB links: 1 PDB ID matches this monomer.
  Tab Delimited (TSV)   2D SDfile   Computed 3D by Vconf -m prep SDfile
Find this compound or compounds like it in BindingDB:
Activity Spreadsheet -- Enzyme Inhibition Constant Data from BindingDB
Found 15 hits for monomerid = 50099062
Targetvon Hippel-Lindau disease tumor suppressor(Homo sapiens (Human))
University Of Dundee
Curated by ChEMBL
LigandPNGBDBM50099062(CHEMBL3344081 | US10730870, Example 3 | US11512083...)
Affinity DataKd:  185nM. Assay description: Binding affinity to N-terminal His6-tagged pVHL (54 to 213 amino acids) (unknown origin) expressed in Escherichia coli BL21 (DE3) by isothermal titra...
Targetvon Hippel-Lindau disease tumor suppressor(Homo sapiens (Human))
University Of Dundee
Curated by ChEMBL
LigandPNGBDBM50099062(CHEMBL3344081 | US10730870, Example 3 | US11512083...)
Affinity DataKd:  113nM. Assay description: Binding affinity to N-terminal His6-tagged VHL (54 to 213 residues) (unknown origin) expressed in Escherichia coli assessed as displacement of HIF-1a...
TargetElongin-C(Homo sapiens (Human))
University Of Dundee
Curated by ChEMBL
LigandPNGBDBM50099062(CHEMBL3344081 | US10730870, Example 3 | US11512083...)
Affinity DataKd:  107nM. Assay description: Binding affinity to VBC (unknown origin) at 50 uM at 20 degC by surface plasmon resonance assay
TargetElongin-C(Homo sapiens (Human))
University Of Dundee
Curated by ChEMBL
LigandPNGBDBM50099062(CHEMBL3344081 | US10730870, Example 3 | US11512083...)
Affinity DataKd:  123nM. Assay description: Binding affinity to VBC (unknown origin) at 50 uM at 10 degC by surface plasmon resonance assay
TargetElongin-C(Homo sapiens (Human))
University Of Dundee
Curated by ChEMBL
LigandPNGBDBM50099062(CHEMBL3344081 | US10730870, Example 3 | US11512083...)
Affinity DataKd:  185nM. Assay description: Binding affinity to VHL (unknown origin)/elongin C (unknown origin)/elongin B (unknown origin) by isothermal titration calorimetry-based assay
TargetElongin-C(Homo sapiens (Human))
University Of Dundee
Curated by ChEMBL
LigandPNGBDBM50099062(CHEMBL3344081 | US10730870, Example 3 | US11512083...)
Affinity DataKd:  150nM. Assay description: Displacement of FAM-labeled HIF-1alpha peptide from VBC (unknown origin) by fluorescence polarization assay
Targetvon Hippel-Lindau disease tumor suppressor(Homo sapiens (Human))
University Of Dundee
Curated by ChEMBL
LigandPNGBDBM50099062(CHEMBL3344081 | US10730870, Example 3 | US11512083...)
Affinity DataIC50:  2.54E+3nM. Assay description: Ability of VHL ligands to compete for the HIF 1 a binding site on VCB was determined through a fluorescence polarization competition assay as describ...
Targetvon Hippel-Lindau disease tumor suppressor(Homo sapiens (Human))
University Of Dundee
Curated by ChEMBL
LigandPNGBDBM50099062(CHEMBL3344081 | US10730870, Example 3 | US11512083...)
Affinity DataIC50:  696nM. Assay description: Ability of VHL ligands to compete for the HIF 1 a binding site on VCB was determined through a fluorescence polarization competition assay as describ...
Targetvon Hippel-Lindau disease tumor suppressor(Homo sapiens (Human))
University Of Dundee
Curated by ChEMBL
LigandPNGBDBM50099062(CHEMBL3344081 | US10730870, Example 3 | US11512083...)
Affinity DataIC50:  1.48E+3nM. Assay description: Ability of VHL ligands to compete for the HIF 1 a binding site on VCB was determined through a fluorescence polarization competition assay as describ...
Targetvon Hippel-Lindau disease tumor suppressor(Homo sapiens (Human))
University Of Dundee
Curated by ChEMBL
LigandPNGBDBM50099062(CHEMBL3344081 | US10730870, Example 3 | US11512083...)
Affinity DataKd:  120nM. Assay description: The surface plasmon resonance (SPR) experiments were conducted on a Biacore3000 (GE Healthcare). His-tagged VHL protein was immobilized on a carboxym...
Targetvon Hippel-Lindau disease tumor suppressor(Homo sapiens (Human))
University Of Dundee
Curated by ChEMBL
LigandPNGBDBM50099062(CHEMBL3344081 | US10730870, Example 3 | US11512083...)
Affinity DataIC50:  185nM. Assay description: Inhibition of VHL (unknown origin) by fluorescence polarization assay
TargetVHL complex(Homo sapiens (Human))
Arvinas Operations
US Patent
LigandPNGBDBM50099062(CHEMBL3344081 | US10730870, Example 3 | US11512083...)
Affinity DataIC50:  2.54E+3nM. Assay description: Ability of VHL ligands to compete for the HIF 1 a binding site on VCB was determined through a fluorescence polarization competition assay as describ...
TargetVHL complex(Homo sapiens (Human))
Arvinas Operations
US Patent
LigandPNGBDBM50099062(CHEMBL3344081 | US10730870, Example 3 | US11512083...)
Affinity DataIC50:  696nM. Assay description: Ability of VHL ligands to compete for the HIF 1 a binding site on VCB was determined through a fluorescence polarization competition assay as describ...
TargetVHL complex(Homo sapiens (Human))
Arvinas Operations
US Patent
LigandPNGBDBM50099062(CHEMBL3344081 | US10730870, Example 3 | US11512083...)
Affinity DataIC50:  1.48E+3nM. Assay description: Ability of VHL ligands to compete for the HIF 1 a binding site on VCB was determined through a fluorescence polarization competition assay as describ...
LigandPNGBDBM50099062(CHEMBL3344081 | US10730870, Example 3 | US11512083...)
Affinity DataIC50:  800nM. Assay description: Inhibition of His-tagged VHL/elongin B/elongin C (unknown origin) interaction with HIF1alpha preincubated for 10 mins followed by fluorescin labelled...