BDBM50099094 (S)-1-{2-[Hydroxy-(4-hydroxy-3-methoxy-benzoyl)-amino]-ethoxycarbonyl}-2-methyl-butyl-ammonium
SMILES CCC(C)[C@H]([NH3+])C(=O)OCCN(O)C(=O)c1ccc(O)c(OC)c1
InChI Key InChIKey=GTERTKJTBFYLSV-SBNLOKMTSA-O
Data  1 IC50
  Tab Delimited (TSV)   2D SDfile   Computed 3D by Vconf -m prep SDfile
Find this compound or compounds like it in BindingDB:
Activity Spreadsheet -- Enzyme Inhibition Constant Data from BindingDB
Found 1 hit for monomerid = 50099094
TargetIsoleucine--tRNA ligase, cytoplasmic(Homo sapiens (Human))
Seoul National University
Curated by ChEMBL
LigandPNGBDBM50099094((S)-1-{2-[Hydroxy-(4-hydroxy-3-methoxy-benzoyl)-am...)
Affinity DataIC50:  1.28E+4nM. Assay description: Inhibitory concentration against isoleucyl-tRNA synthetase was determined by measuring decrease of the aminoacylation product [3H]- isoleucyl tRNA of...
In DepthDetails ArticlePubMed