BDBM50099107 (S)-1-[(S)-2-(4-Hydroxy-3-methoxy-phenyl)-4,5-dihydro-oxazol-4-ylmethoxycarbonyl]-3-methylsulfanyl-propyl-ammonium
SMILES COc1cc(ccc1O)C1=N[C@H](COC(=O)[C@@H]([NH3+])CCSC)CO1
InChI Key InChIKey=RPXIJXVRWSNMOW-RYUDHWBXSA-O
Data  1 IC50
  Tab Delimited (TSV)   2D SDfile   Computed 3D by Vconf -m prep SDfile
Find this compound or compounds like it in BindingDB:
Activity Spreadsheet -- Enzyme Inhibition Constant Data from BindingDB
Found 1 hit for monomerid = 50099107
TargetMethionine--tRNA ligase, cytoplasmic(Homo sapiens (Human))
Seoul National University
Curated by ChEMBL
LigandPNGBDBM50099107((S)-1-[(S)-2-(4-Hydroxy-3-methoxy-phenyl)-4,5-dihy...)
Affinity DataIC50:  3.35E+4nM. Assay description: Inhibitory concentration against methionyl-tRNA synthetase was determined by measuring decrease of the aminoacylation product [35S]- methionyl tRNA o...
In DepthDetails ArticlePubMed