BDBM50099349 2-(2,3-Dimethyl-phenoxy)-4-[5-(4-fluoro-phenyl)-3-piperidin-4-yl-3H-imidazol-4-yl]-pyrimidine::CHEMBL14212
SMILES Cc1cccc(Oc2nccc(n2)-c2c(ncn2C2CCNCC2)-c2ccc(F)cc2)c1C
InChI Key InChIKey=YJNZNIAEANFDMJ-UHFFFAOYSA-N
Data  2 IC50
PDB links: 1 PDB ID matches this monomer.
  Tab Delimited (TSV)   2D SDfile   Computed 3D by Vconf -m prep SDfile
Find this compound or compounds like it in BindingDB:
Activity Spreadsheet -- Enzyme Inhibition Constant Data from BindingDB
Found 2 hits for monomerid = 50099349
TargetMitogen-activated protein kinase 14(Homo sapiens (Human))
University College Of Pharmaceutical Sciences
Curated by ChEMBL
LigandPNGBDBM50099349(2-(2,3-Dimethyl-phenoxy)-4-[5-(4-fluoro-phenyl)-3-...)
Affinity DataIC50:  15nM. Assay description: Inhibition of p38alpha
In DepthDetails ArticlePubMed
TargetMitogen-activated protein kinase 14(Homo sapiens (Human))
University College Of Pharmaceutical Sciences
Curated by ChEMBL
LigandPNGBDBM50099349(2-(2,3-Dimethyl-phenoxy)-4-[5-(4-fluoro-phenyl)-3-...)
Affinity DataIC50:  15nM. Assay description: Inhibitory concentration against mitogen-activated protein kinase p38 alpha
In DepthDetails ArticlePubMed