BDBM50099358 2-{4-[5-(4-Fluoro-phenyl)-3-piperidin-4-yl-3H-imidazol-4-yl]-pyrimidin-2-yloxy}-phenol::CHEMBL273432
SMILES Oc1ccccc1Oc1nccc(n1)-c1c(ncn1C1CCNCC1)-c1ccc(F)cc1
InChI Key InChIKey=DCNFVKCZGQMLNO-UHFFFAOYSA-N
Data  2 IC50
  Tab Delimited (TSV)   2D SDfile   Computed 3D by Vconf -m prep SDfile
Find this compound or compounds like it in BindingDB:
Activity Spreadsheet -- Enzyme Inhibition Constant Data from BindingDB
Found 2 hits for monomerid = 50099358
TargetMitogen-activated protein kinase 14(Homo sapiens (Human))
University College Of Pharmaceutical Sciences
Curated by ChEMBL
LigandPNGBDBM50099358(2-{4-[5-(4-Fluoro-phenyl)-3-piperidin-4-yl-3H-imid...)
Affinity DataIC50:  6.60nM. Assay description: Inhibition of p38alpha
In DepthDetails ArticlePubMed
TargetMitogen-activated protein kinase 14(Homo sapiens (Human))
University College Of Pharmaceutical Sciences
Curated by ChEMBL
LigandPNGBDBM50099358(2-{4-[5-(4-Fluoro-phenyl)-3-piperidin-4-yl-3H-imid...)
Affinity DataIC50:  6.60nM. Assay description: Inhibitory concentration against mitogen-activated protein kinase p38 alpha
In DepthDetails ArticlePubMed