BDBM50099388 CHEMBL3344263
SMILES OC(=O)C(F)(F)F.CC(C)C[C@H](NC(=O)[C@H](C)NC(=O)[C@H](CCCNC(N)=N)NC(=O)OCc1ccccc1)[C@@H](O)CC(=O)NCCc1ccccc1
InChI Key InChIKey=ANRXNIDAKJRWSN-WHHDSKRTSA-N
Data  3 IC50
  Tab Delimited (TSV)   2D SDfile   Computed 3D by Vconf -m prep SDfile
Find this compound or compounds like it in BindingDB:
Activity Spreadsheet -- Enzyme Inhibition Constant Data from BindingDB
Found 3 hits for monomerid = 50099388
TargetPlasmepsin V(Plasmodium falciparum (isolate 3D7))
The Walter And Eliza Hall Institute Of Medical Research
Curated by ChEMBL
LigandPNGBDBM50099388(CHEMBL3344263)
Affinity DataIC50:  622nM. Assay description: Inhibition of Plasmodium falciparum plasmepsin V assessed as cleavage of wtKAHRP fluorogenic substrate
In DepthDetails ArticlePubMed
TargetBeta-secretase 1(Homo sapiens (Human))
The Walter And Eliza Hall Institute Of Medical Research
Curated by ChEMBL
LigandPNGBDBM50099388(CHEMBL3344263)
Affinity DataIC50: >1.00E+5nM. Assay description: Inhibition of human BACE1 assessed as cleavage of TRF substrate
In DepthDetails ArticlePubMed
TargetCathepsin D(Homo sapiens (Human))
The Walter And Eliza Hall Institute Of Medical Research
Curated by ChEMBL
LigandPNGBDBM50099388(CHEMBL3344263)
Affinity DataIC50:  2.90E+4nM. Assay description: Inhibition of human cathepsin D assessed as cleavage of wtKAHRP fluorogenic substrate
In DepthDetails ArticlePubMed