BDBM50099704 CHEMBL301801::[(9,10-Dioxo-9,10-dihydro-phenanthrene-3-carbonyl)-amino]-acetic acid
SMILES OC(=O)CNC(=O)c1ccc2C(=O)C(=O)c3ccccc3-c2c1
InChI Key InChIKey=YUJBSBZBNRYGQS-UHFFFAOYSA-N
Data  1 IC50
  Tab Delimited (TSV)   2D SDfile   Computed 3D by Vconf -m prep SDfile
Find this compound or compounds like it in BindingDB:
Activity Spreadsheet -- Enzyme Inhibition Constant Data from BindingDB
Found 1 hit for monomerid = 50099704
TargetReceptor-type tyrosine-protein phosphatase C(Homo sapiens (Human))
Astrazeneca Pharmaceuticals
Curated by ChEMBL
LigandPNGBDBM50099704(CHEMBL301801 | [(9,10-Dioxo-9,10-dihydro-phenanthr...)
Affinity DataIC50:  500nM. Assay description: In vitro inhibitory activity against the cytosolic portion of CD45 protein-tyrosine phosphatase using pNPP as the substrate
In DepthDetails ArticlePubMed