BDBM50099866 CHEMBL418388::Sodium; (E)-2-amino-5-(3,4-diethyl-phenyl)-5-(2,4-difluoro-phenyl)-pent-4-enoate
SMILES CCc1ccc(cc1CC)C(=C/CC(N)C([O-])=O)\c1ccc(F)cc1F
InChI Key InChIKey=WNTAPKFMXVBWHD-RQZCQDPDSA-M
Data  2 IC50
  Tab Delimited (TSV)   2D SDfile   Computed 3D by Vconf -m prep SDfile
Find this compound or compounds like it in BindingDB:
Activity Spreadsheet -- Enzyme Inhibition Constant Data from BindingDB
Found 2 hits for monomerid = 50099866
TargetSodium- and chloride-dependent glycine transporter 1(attus norvegicus (Rat))
Nps Pharmaceuticals
Curated by ChEMBL
LigandPNGBDBM50099866(CHEMBL418388 | Sodium; (E)-2-amino-5-(3,4-diethyl-...)
Affinity DataIC50: >1.00E+4nM. Assay description: In vitro glycine reuptake inhibitory activity against glycine transporter type-1 isoform C (GlyT-1c) transporter cells after incubation at 30 degrees...
In DepthDetails ArticlePubMed
TargetSodium- and chloride-dependent glycine transporter 2(Rattus norvegicus)
Nps Pharmaceuticals
Curated by ChEMBL
LigandPNGBDBM50099866(CHEMBL418388 | Sodium; (E)-2-amino-5-(3,4-diethyl-...)
Affinity DataIC50:  660nM. Assay description: In vitro glycine reuptake inhibitory activity against glycine transporter type-2 (GlyT-2) transporter cells after incubation at 30 degrees for 30 min...
In DepthDetails ArticlePubMed