BDBM50100367 3-(4-Carbamimidoyl-benzoyl)-3-aza-spiro[5.5]undecane-9-carboxylic acid::CHEMBL25990
SMILES NC(=N)c1ccc(cc1)C(=O)N1CCC2(CCC(CC2)C(O)=O)CC1
InChI Key InChIKey=JTIDVFSMRYUKKU-UHFFFAOYSA-N
Data  1 IC50
  Tab Delimited (TSV)   2D SDfile   Computed 3D by Vconf -m prep SDfile
Find this compound or compounds like it in BindingDB:
Activity Spreadsheet -- Enzyme Inhibition Constant Data from BindingDB
Found 1 hit for monomerid = 50100367
TargetIntegrin alpha-IIb/beta-3(Homo sapiens (Human))
Cor Therapeutics
Curated by ChEMBL
LigandPNGBDBM50100367(3-(4-Carbamimidoyl-benzoyl)-3-aza-spiro[5.5]undeca...)
Affinity DataIC50:  1.50E+4nM. Assay description: In vitro inhibitory activity against blockage of binding of fibrinogen to purified human GPIIbIIIa
In DepthDetails ArticlePubMed