BDBM50100373 4-[(3-Pyridin-4-yl-3-aza-spiro[5.5]undecane-9-carbonyl)-amino]-butyric acid::CHEMBL26067
SMILES OC(=O)CCCNC(=O)C1CCC2(CC1)CCN(CC2)c1ccncc1
InChI Key InChIKey=LUILGBSAWABNTA-UHFFFAOYSA-N
Data  1 IC50
  Tab Delimited (TSV)   2D SDfile   Computed 3D by Vconf -m prep SDfile
Find this compound or compounds like it in BindingDB:
Activity Spreadsheet -- Enzyme Inhibition Constant Data from BindingDB
Found 1 hit for monomerid = 50100373
TargetIntegrin alpha-IIb/beta-3(Homo sapiens (Human))
Cor Therapeutics
Curated by ChEMBL
LigandPNGBDBM50100373(4-[(3-Pyridin-4-yl-3-aza-spiro[5.5]undecane-9-carb...)
Affinity DataIC50:  319nM. Assay description: In vitro inhibitory activity against blockage of binding of fibrinogen to purified human GPIIbIIIa
In DepthDetails ArticlePubMed