BDBM50100485 CHEMBL66305::N-{4-Hydroxy-5-hydroxymethyl-2-[6-(3-methyl-benzylamino)-purin-9-ylmethyl]-tetrahydro-furan-3-yl}-3,5-dimethoxy-benzamide
SMILES COc1cc(OC)cc(c1)C(=O)N[C@@H]1C(Cn2cnc3c(NCc4cccc(C)c4)ncnc23)OC(CO)[C@@H]1O
InChI Key InChIKey=ROLCITGNHINHPT-WZCQUIKNSA-N
Data  1 IC50
  Tab Delimited (TSV)   2D SDfile   Computed 3D by Vconf -m prep SDfile
Find this compound or compounds like it in BindingDB:
Activity Spreadsheet -- Enzyme Inhibition Constant Data from BindingDB
Found 1 hit for monomerid = 50100485
TargetGlyceraldehyde-3-phosphate dehydrogenase, cytosolic(Leishmania mexicana)
University Of Washington
Curated by ChEMBL
LigandPNGBDBM50100485(CHEMBL66305 | N-{4-Hydroxy-5-hydroxymethyl-2-[6-(3...)
Affinity DataIC50:  2.50E+4nM. Assay description: Inhibitory activity against Leishmania mexicana GAPDH
In DepthDetails ArticlePubMed