BDBM50100498 CHEMBL66195::N-{4-Hydroxy-5-hydroxymethyl-2-[6-(1,2,3,4-tetrahydro-naphthalen-1-ylamino)-purin-9-ylmethyl]-tetrahydro-furan-3-yl}-3,5-dimethoxy-benzamide
SMILES COc1cc(OC)cc(c1)C(=O)N[C@@H]1C(Cn2cnc3c(NC4CCCc5ccccc45)ncnc23)OC(CO)[C@@H]1O
InChI Key InChIKey=SUKKKEFAMPNTFZ-YLAQNYHASA-N
Data  1 IC50
  Tab Delimited (TSV)   2D SDfile   Computed 3D by Vconf -m prep SDfile
Find this compound or compounds like it in BindingDB:
Activity Spreadsheet -- Enzyme Inhibition Constant Data from BindingDB
Found 1 hit for monomerid = 50100498
TargetGlyceraldehyde-3-phosphate dehydrogenase, cytosolic(Leishmania mexicana)
University Of Washington
Curated by ChEMBL
LigandPNGBDBM50100498(CHEMBL66195 | N-{4-Hydroxy-5-hydroxymethyl-2-[6-(1...)
Affinity DataIC50:  7.50E+4nM. Assay description: Inhibitory activity against Leishmania mexicana GAPDH
In DepthDetails ArticlePubMed