BDBM50100500 CHEMBL66196::N-{2-[6-(Benzhydryl-amino)-purin-9-ylmethyl]-4-hydroxy-5-hydroxymethyl-tetrahydro-furan-3-yl}-3,5-dimethoxy-benzamide
SMILES COc1cc(OC)cc(c1)C(=O)N[C@@H]1C(Cn2cnc3c(NC(c4ccccc4)c4ccccc4)ncnc23)OC(CO)[C@@H]1O
InChI Key InChIKey=ZAIHEDOXKISERL-YHHHHRRWSA-N
Data  1 IC50
  Tab Delimited (TSV)   2D SDfile   Computed 3D by Vconf -m prep SDfile
Find this compound or compounds like it in BindingDB:
Activity Spreadsheet -- Enzyme Inhibition Constant Data from BindingDB
Found 1 hit for monomerid = 50100500
TargetGlyceraldehyde-3-phosphate dehydrogenase, cytosolic(Leishmania mexicana)
University Of Washington
Curated by ChEMBL
LigandPNGBDBM50100500(CHEMBL66196 | N-{2-[6-(Benzhydryl-amino)-purin-9-y...)
Affinity DataIC50:  5.50E+4nM. Assay description: Inhibitory activity against Leishmania mexicana GAPDH
In DepthDetails ArticlePubMed