BDBM50100792 2-[3-(4-Fluoro-phenyl)-1-(2-nitro-benzyl)-ureido]-propionic acid::CHEMBL70254
SMILES CC(N(Cc1ccccc1[N+]([O-])=O)C(=O)Nc1ccc(F)cc1)C(O)=O
InChI Key InChIKey=SOUDBMPGSXOWTG-UHFFFAOYSA-N
Data  1 KI
  Tab Delimited (TSV)   2D SDfile   Computed 3D by Vconf -m prep SDfile
Find this compound or compounds like it in BindingDB:
Activity Spreadsheet -- Enzyme Inhibition Constant Data from BindingDB
Found 1 hit for monomerid = 50100792
TargetCollagenase ColA(Clostridium perfringens)
The University Of Western Australia
Curated by ChEMBL
LigandPNGBDBM50100792(2-[3-(4-Fluoro-phenyl)-1-(2-nitro-benzyl)-ureido]-...)
Affinity DataKi:  6.20E+3nM. Assay description: Inhibitory activity against clostridium histolyticum collagenase
In DepthDetails ArticlePubMed