BDBM50100857 CHEMBL418895::N-Hydroxy-2-[(2-nitro-benzyl)-(4-nitro-phenylsulfanyl)-amino]-propionamide
SMILES CC(N(Cc1ccccc1[N+]([O-])=O)Sc1ccc(cc1)[N+]([O-])=O)C(=O)NO
InChI Key InChIKey=YGNBXMMBEIMICG-UHFFFAOYSA-N
Data  1 KI
  Tab Delimited (TSV)   2D SDfile   Computed 3D by Vconf -m prep SDfile
Find this compound or compounds like it in BindingDB:
Activity Spreadsheet -- Enzyme Inhibition Constant Data from BindingDB
Found 1 hit for monomerid = 50100857
TargetCollagenase ColA(Clostridium perfringens)
The University Of Western Australia
Curated by ChEMBL
LigandPNGBDBM50100857(CHEMBL418895 | N-Hydroxy-2-[(2-nitro-benzyl)-(4-ni...)
Affinity DataKi:  13nM. Assay description: Inhibitory activity against clostridium histolyticum collagenase
In DepthDetails ArticlePubMed