BDBM50100875 (Z)-2,2-Dimethyl-1-oxazol-2-yl-octadec-9-en-1-one::CHEMBL36655
SMILES CCCCCCCC\C=C/CCCCCCC(C)(C)C(=O)c1ncco1
InChI Key InChIKey=UIQYHSVDCXHKSQ-QXMHVHEDSA-N
Data  2 KI
  Tab Delimited (TSV)   2D SDfile   Computed 3D by Vconf -m prep SDfile
Find this compound or compounds like it in BindingDB:
Activity Spreadsheet -- Enzyme Inhibition Constant Data from BindingDB
Found 2 hits for monomerid = 50100875
TargetFatty-acid amide hydrolase 1 [30-579](Rattus norvegicus (rat))
The Scripps Research Institute
Curated by ChEMBL
LigandPNGBDBM50100875((Z)-2,2-Dimethyl-1-oxazol-2-yl-octadec-9-en-1-one ...)
Affinity DataKi:  1.42E+4nM. Assay description: Inhibitory constant determined against recombinant Fatty-acid amide hydrolase from rat expressed in Escherichia coli
In DepthDetails ArticlePubMed
TargetFatty-acid amide hydrolase 1 [30-579](Rattus norvegicus (rat))
The Scripps Research Institute
Curated by ChEMBL
LigandPNGBDBM50100875((Z)-2,2-Dimethyl-1-oxazol-2-yl-octadec-9-en-1-one ...)
Affinity DataKi:  1.42E+4nM. Assay description: Inhibitory activity against fatty acid amide hydrolase (FAAH)
In DepthDetails ArticlePubMed