BDBM50100932 CHEMBL416421::N-{2-(4,4-Dimethyl-2,5-dioxo-imidazolidin-1-yl)-1-[4'-(2-methoxy-ethoxy)-biphenyl-4-yloxymethyl]-ethyl}-N-hydroxy-formamide
SMILES COCCOc1ccc(cc1)-c1ccc(OCC(CN2C(=O)NC(C)(C)C2=O)N(O)C=O)cc1
InChI Key InChIKey=ZLPOIHFXRODFHL-UHFFFAOYSA-N
Data  2 IC50
  Tab Delimited (TSV)   2D SDfile   Computed 3D by Vconf -m prep SDfile
Find this compound or compounds like it in BindingDB:
Activity Spreadsheet -- Enzyme Inhibition Constant Data from BindingDB
Found 2 hits for monomerid = 50100932
Target72 kDa type IV collagenase(Homo sapiens (Human))
Abbott Laboratories
Curated by ChEMBL
LigandPNGBDBM50100932(CHEMBL416421 | N-{2-(4,4-Dimethyl-2,5-dioxo-imidaz...)
Affinity DataIC50:  4nM. Assay description: In vitro inhibition of human Matrix metalloproteinase-2.
In DepthDetails ArticlePubMed
TargetInterstitial collagenase(Homo sapiens (Human))
Abbott Laboratories
Curated by ChEMBL
LigandPNGBDBM50100932(CHEMBL416421 | N-{2-(4,4-Dimethyl-2,5-dioxo-imidaz...)
Affinity DataIC50: >1.00E+4nM. Assay description: In vitro inhibition of human Matrix metalloproteinase-1.
In DepthDetails ArticlePubMed