BDBM50101443 CHEMBL3393948
SMILES OC(=O)CCc1c([nH]c2c(ccc(-c3ccc(cc3)[N+]([O-])=O)c12)[N+]([O-])=O)C(O)=O
InChI Key InChIKey=UYQZOSCSHFRIAN-UHFFFAOYSA-N
Data  1 IC50
  Tab Delimited (TSV)   2D SDfile   Computed 3D by Vconf -m prep SDfile
Find this compound or compounds like it in BindingDB:
Activity Spreadsheet -- Enzyme Inhibition Constant Data from BindingDB
Found 1 hit for monomerid = 50101443
TargetFructose-1,6-bisphosphatase 1(Homo sapiens (Human))
Chinese Academy Of Medical Sciences & Peking Union Medical College
Curated by ChEMBL
LigandPNGBDBM50101443(CHEMBL3393948)
Affinity DataIC50:  2.00E+3nM. Assay description: Inhibition of human liver FBPase expressed in Escherichia coli BL21(DE3) Rosetta cells assessed as reduction of NADP+ to NADPH by phosphoglucose isom...
In DepthDetails ArticlePubMed