BDBM50101704 Bisubstrate Analogue::[5-(6-amino-9H-purin-9-yl)-4-hydroxy-2-({[hydroxy({hydroxy[3-hydroxy-3-({2-[(2-{[3-hydroxy-6-(1H-indol-3-yl)hexyl]sulfanyl}ethyl)carbamoyl]ethyl}carbamoyl)-2,2-dimethylpropoxy]phosphoryl}oxy)phosphoryl]oxy}methyl)oxolan-3-yl] phosphate
SMILES CC(C)(COP(O)(=O)OP(O)(=O)OCC1OC(C(O)C1OP([O-])([O-])=O)n1cnc2c(N)ncnc12)C(O)C(=O)NCCC(=O)NCCSCCC(O)CCCc1c[nH]c2ccccc12
InChI Key InChIKey=DWNMTYQHKXHUDS-UHFFFAOYSA-L
Data  1 KI
  Tab Delimited (TSV)   2D SDfile   Computed 3D by Vconf -m prep SDfile
Find this compound or compounds like it in BindingDB:
Activity Spreadsheet -- Enzyme Inhibition Constant Data from BindingDB
Found 1 hit for monomerid = 50101704
TargetSerotonin N-acetyltransferase(Ovis aries)
Johns Hopkins University School Of Medicine
Curated by ChEMBL
LigandPNGBDBM50101704(Bisubstrate Analogue | [5-(6-amino-9H-purin-9-yl)-...)
Affinity DataKi:  1.10E+3nM. Assay description: Inhibition of serotonin N-acetyl-transferase
In DepthDetails ArticlePubMed