BDBM50101884 2-(2-Hydroxy-5-methyl-phenyl)-1H-indole-5-carboxamidine::CHEMBL54311
SMILES Cc1ccc(O)c(c1)-c1cc2cc(ccc2[nH]1)C(N)=N
InChI Key InChIKey=ZEJKPIWHZAIROY-UHFFFAOYSA-N
Data  5 KI
  Tab Delimited (TSV)   2D SDfile   Computed 3D by Vconf -m prep SDfile
Find this compound or compounds like it in BindingDB:
Activity Spreadsheet -- Enzyme Inhibition Constant Data from BindingDB
Found 5 hits for monomerid = 50101884
TargetCoagulation factor X(Homo sapiens (Human))
Axys Pharmaceuticals
Curated by ChEMBL
LigandPNGBDBM50101884(2-(2-Hydroxy-5-methyl-phenyl)-1H-indole-5-carboxam...)
Affinity DataKi:  4.30E+3nM. Assay description: Inhibitory activity against Coagulation factor X in human plasma
In DepthDetails ArticlePubMed
TargetSerine protease 1(Homo sapiens (Human))
Axys Pharmaceuticals
Curated by ChEMBL
LigandPNGBDBM50101884(2-(2-Hydroxy-5-methyl-phenyl)-1H-indole-5-carboxam...)
Affinity DataKi:  8.20E+3nM. Assay description: Inhibitory activity against trypsin in human plasma
In DepthDetails ArticlePubMed
TargetUrokinase-type plasminogen activator(Homo sapiens (Human))
Axys Pharmaceuticals
Curated by ChEMBL
LigandPNGBDBM50101884(2-(2-Hydroxy-5-methyl-phenyl)-1H-indole-5-carboxam...)
Affinity DataKi:  1.24E+4nM. Assay description: Inhibitory activity against urokinase-type plasminogen activator (microPa) in human plasma
In DepthDetails ArticlePubMed
TargetPlasminogen(Homo sapiens (Human))
Axys Pharmaceuticals
Curated by ChEMBL
LigandPNGBDBM50101884(2-(2-Hydroxy-5-methyl-phenyl)-1H-indole-5-carboxam...)
Affinity DataKi:  2.10E+4nM. Assay description: Inhibitory activity against plasmin in human plasma
In DepthDetails ArticlePubMed
TargetProthrombin(Homo sapiens (Human))
Axys Pharmaceuticals
Curated by ChEMBL
LigandPNGBDBM50101884(2-(2-Hydroxy-5-methyl-phenyl)-1H-indole-5-carboxam...)
Affinity DataKi:  2.30E+4nM. Assay description: Inhibitory activity against thrombin(fIIa) in human plasma
In DepthDetails ArticlePubMed