BDBM50101917 20-oxo-2-oxa-9,11,15,19-tetraazapentacyclo[19.6.2.13,7.09,13.025,29]triaconta-1(28),3,5,7(30),10,12,21(29),22,24,26-decaen-4-yl cyanide::CHEMBL53037
SMILES O=C1NCCCNCc2cncn2Cc2ccc(C#N)c(Oc3ccc4cccc1c4c3)c2
InChI Key InChIKey=AFXXVFSLJYLSOC-UHFFFAOYSA-N
Data  3 IC50
  Tab Delimited (TSV)   2D SDfile   Computed 3D by Vconf -m prep SDfile
Find this compound or compounds like it in BindingDB:
Activity Spreadsheet -- Enzyme Inhibition Constant Data from BindingDB
Found 3 hits for monomerid = 50101917
TargetProtein farnesyltransferase subunit beta/geranylgeranyltransferase type-1 subunit alpha(Homo sapiens (Human))
Merck Research Laboratories
Curated by ChEMBL
LigandPNGBDBM50101917(20-oxo-2-oxa-9,11,15,19-tetraazapentacyclo[19.6.2....)
Affinity DataIC50:  2.30nM. Assay description: In vitro inhibitory activity to reduce the human farnesyltransferase catalyzed incorporation of [3H]-FPP into recombinant Ras-CVIM
In DepthDetails ArticlePubMed
LigandPNGBDBM50101917(20-oxo-2-oxa-9,11,15,19-tetraazapentacyclo[19.6.2....)
Affinity DataIC50:  890nM. Assay description: In vitro inhibitory activity to reduce the human geranylgeranyl transferase type I (GGPTase-1)-catalyzed incorporation of 3H GGPP (100 nM) into K-Ras...
In DepthDetails ArticlePubMed
TargetProtein farnesyltransferase subunit beta/geranylgeranyltransferase type-1 subunit alpha(Rattus norvegicus)
Merck Research Laboratories
Curated by ChEMBL
LigandPNGBDBM50101917(20-oxo-2-oxa-9,11,15,19-tetraazapentacyclo[19.6.2....)
Affinity DataIC50:  99nM. Assay description: In vitro ability of the compound to displace radiolabelled FTI from farnesyltransferase in cultured Ha-ras transformed RAT1 cells
In DepthDetails ArticlePubMed