BDBM50101990 CHEMBL3188333
SMILES CN(C)c1ccc(C=O)cc1
InChI Key InChIKey=BGNGWHSBYQYVRX-UHFFFAOYSA-N
Data  2 KI  2 Kd
  Tab Delimited (TSV)   2D SDfile   Computed 3D by Vconf -m prep SDfile
Find this compound or compounds like it in BindingDB:
Activity Spreadsheet -- Enzyme Inhibition Constant Data from BindingDB
Found 4 hits for monomerid = 50101990
TargetCytochrome P450 2A6(Homo sapiens (Human))
University Of Kansas
Curated by ChEMBL
LigandPNGBDBM50101990(CHEMBL3188333)
Affinity DataKi:  3.60E+3nM. Assay description: Mixed inhibition of CYP2A6 (unknown origin)
In DepthDetails ArticlePubMed
TargetCytochrome P450 2A13(Homo sapiens (Human))
University Of Kansas
Curated by ChEMBL
LigandPNGBDBM50101990(CHEMBL3188333)
Affinity DataKi:  1.70E+4nM. Assay description: Mixed inhibition of CYP2A13 (unknown origin)
In DepthDetails ArticlePubMed
TargetCytochrome P450 2A13(Homo sapiens (Human))
University Of Kansas
Curated by ChEMBL
LigandPNGBDBM50101990(CHEMBL3188333)
Affinity DataKd:  650nM. Assay description: Binding affinity to CYP2A13 (unknown origin) assessed as type 1 interaction as increase in absorbance 379 to 387 nm and decrease in 414 to 420 nm
In DepthDetails ArticlePubMed
TargetCytochrome P450 2A6(Homo sapiens (Human))
University Of Kansas
Curated by ChEMBL
LigandPNGBDBM50101990(CHEMBL3188333)
Affinity DataKd:  680nM. Assay description: Binding affinity to CYP2A6 (unknown origin) assessed as type 1 interaction as increase in absorbance 379 to 387 nm and decrease in 414 to 420 nm
In DepthDetails ArticlePubMed