BDBM50102002 3-[4-(7-Methoxy-3,4-dihydro-1H-isoquinolin-2-yl)-cyclohexyl]-1H-indole-5-carbonitrile::CHEMBL292452
SMILES COc1ccc2CCN(Cc2c1)[C@H]1CC[C@@H](CC1)c1c[nH]c2ccc(cc12)C#N
InChI Key InChIKey=NJOFHKOATSZZIA-XUTJKUGGSA-N
Data  2 KI
  Tab Delimited (TSV)   2D SDfile   Computed 3D by Vconf -m prep SDfile
Find this compound or compounds like it in BindingDB:
Activity Spreadsheet -- Enzyme Inhibition Constant Data from BindingDB
Found 2 hits for monomerid = 50102002
TargetSodium-dependent serotonin transporter(Rattus norvegicus (rat))
Wyeth-Ayerst Research Laboratories
Curated by ChEMBL
LigandPNGBDBM50102002(3-[4-(7-Methoxy-3,4-dihydro-1H-isoquinolin-2-yl)-c...)
Affinity DataKi:  12nM. Assay description: In vitro for its binding affinity for serotonin transporter RB5-HT-T in rat cortical membranes
In DepthDetails ArticlePubMed
TargetAlpha-1A/Alpha-1B/Alpha-1D adrenergic receptor(Rattus norvegicus (rat))
Wyeth-Ayerst Research Laboratories
Curated by ChEMBL
LigandPNGBDBM50102002(3-[4-(7-Methoxy-3,4-dihydro-1H-isoquinolin-2-yl)-c...)
Affinity DataKi:  113nM. Assay description: Binding affinity at Alpha-1 adrenergic receptors on rat cortical membranes by [3H]prazosin displacement.
In DepthDetails ArticlePubMed