BDBM50102021 3-(4-Benzylamino-cyclohexyl)-1H-indole-5-carbonitrile::CHEMBL59196
SMILES N#Cc1ccc2[nH]cc([C@H]3CC[C@@H](CC3)NCc3ccccc3)c2c1
InChI Key InChIKey=DERACDLDOCQASG-WGSAOQKQSA-N
Data  1 KI
  Tab Delimited (TSV)   2D SDfile   Computed 3D by Vconf -m prep SDfile
Find this compound or compounds like it in BindingDB:
Activity Spreadsheet -- Enzyme Inhibition Constant Data from BindingDB
Found 1 hit for monomerid = 50102021
TargetSodium-dependent serotonin transporter(Rattus norvegicus (rat))
Wyeth-Ayerst Research Laboratories
Curated by ChEMBL
LigandPNGBDBM50102021(3-(4-Benzylamino-cyclohexyl)-1H-indole-5-carbonitr...)
Affinity DataKi:  25nM. Assay description: In vitro for its binding affinity for serotonin transporter RB5-HT-T in rat cortical membranes
In DepthDetails ArticlePubMed