BDBM50102024 3-(4-Phenethylamino-cyclohexyl)-1H-indole-5-carbonitrile::CHEMBL56030
SMILES N#Cc1ccc2[nH]cc([C@@H]3CC[C@@H](CC3)NCCc3ccccc3)c2c1
InChI Key InChIKey=GMOSPGFRDPBEEZ-BGYRXZFFSA-N
Data  1 KI
  Tab Delimited (TSV)   2D SDfile   Computed 3D by Vconf -m prep SDfile
Find this compound or compounds like it in BindingDB:
Activity Spreadsheet -- Enzyme Inhibition Constant Data from BindingDB
Found 1 hit for monomerid = 50102024
TargetSodium-dependent serotonin transporter(Rattus norvegicus (rat))
Wyeth-Ayerst Research Laboratories
Curated by ChEMBL
LigandPNGBDBM50102024(3-(4-Phenethylamino-cyclohexyl)-1H-indole-5-carbon...)
Affinity DataKi:  7.5nM. Assay description: In vitro for its binding affinity for serotonin transporter RB5-HT-T in rat cortical membranes
In DepthDetails ArticlePubMed