BDBM50102066 (3S,4S)-3-(5-Bromo-2-chloro-benzyl)-4-fluoro-piperidine; hydrochloride::CHEMBL543567
SMILES F[C@H]1CCNC[C@@H]1Cc1cc(Br)ccc1Cl
InChI Key InChIKey=KAPPBYZDLVBXCN-CABZTGNLSA-N
Data  1 IC50
  Tab Delimited (TSV)   2D SDfile   Computed 3D by Vconf -m prep SDfile
Find this compound or compounds like it in BindingDB:
Activity Spreadsheet -- Enzyme Inhibition Constant Data from BindingDB
Found 1 hit for monomerid = 50102066
TargetPhospho-N-acetylmuramoyl-pentapeptide-transferase(Escherichia coli (strain K12))
Pharmacia
Curated by ChEMBL
LigandPNGBDBM50102066((3S,4S)-3-(5-Bromo-2-chloro-benzyl)-4-fluoro-piper...)
Affinity DataIC50: >9.00E+5nM. Assay description: Inhibitory activity against accumulation of [14C]-labeled Linezolid within wild-type Escherichia coli K12 cells
In DepthDetails ArticlePubMed