BDBM50102422 5-(2,5-Dihydroxy-benzylamino)-2-hydroxy-N-(3-phenyl-propyl)-benzamide::5-(2,5-dihydroxybenzylamino)-2-hydroxy-N-(3-phenylpropyl)benzamide::CHEMBL341946
SMILES Oc1ccc(O)c(CNc2ccc(O)c(c2)C(=O)NCCCc2ccccc2)c1
InChI Key InChIKey=NWPOOMNWBCXQHP-UHFFFAOYSA-N
Data  4 IC50
  Tab Delimited (TSV)   2D SDfile   Computed 3D by Vconf -m prep SDfile
Find this compound or compounds like it in BindingDB:
Activity Spreadsheet -- Enzyme Inhibition Constant Data from BindingDB
Found 4 hits for monomerid = 50102422
TargetEpidermal growth factor receptor(Mus musculus)
Purdue University
Curated by ChEMBL
LigandPNGBDBM50102422(5-(2,5-Dihydroxy-benzylamino)-2-hydroxy-N-(3-pheny...)
Affinity DataIC50:  1.00E+3nM. Assay description: Inhibition of epidermal growth factor receptor phosphorylation in BaF3 mouse lymphoid cells.
In DepthDetails ArticlePubMed
TargetTyrosine-protein kinase SYK(Homo sapiens (Human))
Sichuan University
Curated by ChEMBL
LigandPNGBDBM50102422(5-(2,5-Dihydroxy-benzylamino)-2-hydroxy-N-(3-pheny...)
Affinity DataIC50:  2.80E+4nM. Assay description: Inhibition of recombinant Syk (unknown origin)
In DepthDetails ArticlePubMed
TargetTubulin beta-2B chain(Bos taurus)
Purdue University
Curated by ChEMBL
LigandPNGBDBM50102422(5-(2,5-Dihydroxy-benzylamino)-2-hydroxy-N-(3-pheny...)
Affinity DataIC50:  5.00E+3nM. Assay description: Inhibition of bovine tubulin polymerization
In DepthDetails ArticlePubMed
TargetTyrosine-protein kinase SYK(Homo sapiens (Human))
Sichuan University
Curated by ChEMBL
LigandPNGBDBM50102422(5-(2,5-Dihydroxy-benzylamino)-2-hydroxy-N-(3-pheny...)
Affinity DataIC50:  2.80E+4nM. Assay description: In vitro inhibition of Syk protein tyrosine kinase
In DepthDetails ArticlePubMed