BDBM50102468 4-[Carboxy-(4'-methoxy-biphenyl-4-sulfonylamino)-methyl]-piperidine-1-carboxylic acid tert-butyl ester::CHEMBL82169
SMILES COc1ccc(cc1)-c1ccc(cc1)S(=O)(=O)NC(C1CCN(CC1)C(=O)OC(C)(C)C)C(O)=O
InChI Key InChIKey=LFOGEPKUSWRLCL-UHFFFAOYSA-N
Data  9 IC50
  Tab Delimited (TSV)   2D SDfile   Computed 3D by Vconf -m prep SDfile
Find this compound or compounds like it in BindingDB:
Activity Spreadsheet -- Enzyme Inhibition Constant Data from BindingDB
Found 9 hits for monomerid = 50102468
Target72 kDa type IV collagenase(Homo sapiens (Human))
TBA
Curated by ChEMBL
LigandPNGBDBM50102468(4-[Carboxy-(4'-methoxy-biphenyl-4-sulfonylamino)-m...)
Affinity DataIC50:  0.5nM. Assay description: In vitro inhibitory activity against matrix metalloprotease-2
In DepthDetails ArticlePubMed
TargetNeutrophil collagenase(Homo sapiens (Human))
TBA
Curated by ChEMBL
LigandPNGBDBM50102468(4-[Carboxy-(4'-methoxy-biphenyl-4-sulfonylamino)-m...)
Affinity DataIC50:  1.20nM. Assay description: Inhibitory activity against matrix metalloprotease-8
In DepthDetails ArticlePubMed
TargetStromelysin-1(Homo sapiens (Human))
TBA
Curated by ChEMBL
LigandPNGBDBM50102468(4-[Carboxy-(4'-methoxy-biphenyl-4-sulfonylamino)-m...)
Affinity DataIC50:  56.4nM. Assay description: In vitro inhibitory activity against matrix metalloprotease-3
In DepthDetails ArticlePubMed
TargetMatrix metalloproteinase-9(Homo sapiens (Human))
TBA
Curated by ChEMBL
LigandPNGBDBM50102468(4-[Carboxy-(4'-methoxy-biphenyl-4-sulfonylamino)-m...)
Affinity DataIC50:  5.40nM. Assay description: In vitro inhibition of human matrix metalloprotease-9
In DepthDetails ArticlePubMed
TargetNeutrophil collagenase(Homo sapiens (Human))
TBA
Curated by ChEMBL
LigandPNGBDBM50102468(4-[Carboxy-(4'-methoxy-biphenyl-4-sulfonylamino)-m...)
Affinity DataIC50:  1.20nM. Assay description: Inhibition of MMP8
In DepthDetails ArticlePubMed
TargetCollagenase 3(Homo sapiens (Human))
TBA
Curated by ChEMBL
LigandPNGBDBM50102468(4-[Carboxy-(4'-methoxy-biphenyl-4-sulfonylamino)-m...)
Affinity DataIC50:  0.700nM. Assay description: In vitro inhibitory activity against matrix metalloprotease-13
In DepthDetails ArticlePubMed
TargetMatrilysin(Homo sapiens (Human))
TBA
Curated by ChEMBL
LigandPNGBDBM50102468(4-[Carboxy-(4'-methoxy-biphenyl-4-sulfonylamino)-m...)
Affinity DataIC50:  2.59E+3nM. Assay description: Inhibitory activity against matrix metalloprotease-7
In DepthDetails ArticlePubMed
TargetCollagenase 3(Homo sapiens (Human))
TBA
Curated by ChEMBL
LigandPNGBDBM50102468(4-[Carboxy-(4'-methoxy-biphenyl-4-sulfonylamino)-m...)
Affinity DataIC50:  0.708nM. Assay description: Inhibition of MMP13
In DepthDetails ArticlePubMed
TargetInterstitial collagenase(Homo sapiens (Human))
TBA
Curated by ChEMBL
LigandPNGBDBM50102468(4-[Carboxy-(4'-methoxy-biphenyl-4-sulfonylamino)-m...)
Affinity DataIC50:  1.42E+3nM. Assay description: In vitro inhibitory activity against matrix metalloprotease-1
In DepthDetails ArticlePubMed