BDBM50102502 2,4-Diamino-5-{3-[3-benzyl-3-[2-(propionyloxy)ethyl}-triazen-1-yl]-4-chlorophenyl}-6-ethylpyrimidine::CHEMBL314387
SMILES CCC(=O)OCCN(Cc1ccccc1)\N=N\c1cc(ccc1Cl)-c1c(N)nc(N)nc1CC
InChI Key InChIKey=MQOLFQNBFNLFFJ-NVQSTNCTSA-N
Data  2 IC50
  Tab Delimited (TSV)   2D SDfile   Computed 3D by Vconf -m prep SDfile
Find this compound or compounds like it in BindingDB:
Activity Spreadsheet -- Enzyme Inhibition Constant Data from BindingDB
Found 2 hits for monomerid = 50102502
TargetDihydrofolate reductase(Rattus norvegicus (rat))
University Of Nottingham
Curated by ChEMBL
LigandPNGBDBM50102502(2,4-Diamino-5-{3-[3-benzyl-3-[2-(propionyloxy)ethy...)
Affinity DataIC50:  3.30E+3nM. Assay description: Inhibitory activity against dihydrofolate reductase DHFR in rat liver
In DepthDetails ArticlePubMed
TargetBifunctional dihydrofolate reductase-thymidylate synthase(Toxoplasma gondii)
University Of Nottingham
Curated by ChEMBL
LigandPNGBDBM50102502(2,4-Diamino-5-{3-[3-benzyl-3-[2-(propionyloxy)ethy...)
Affinity DataIC50:  700nM. Assay description: Inhibitory activity against dihydrofolate reductase DHFR in Toxoplasma gondii.
In DepthDetails ArticlePubMed