BDBM50102687 4-Butoxy-N-(1-dimethylamino-cyclopentylmethyl)-3,5-dimethoxy-benzamide::CHEMBL431997
SMILES CCCCOc1c(OC)cc(cc1OC)C(=O)NCC1(CCCC1)N(C)C
InChI Key InChIKey=MPIKZGJEXQGEJE-UHFFFAOYSA-N
Data  2 IC50
  Tab Delimited (TSV)   2D SDfile   Computed 3D by Vconf -m prep SDfile
Find this compound or compounds like it in BindingDB:
Activity Spreadsheet -- Enzyme Inhibition Constant Data from BindingDB
Found 2 hits for monomerid = 50102687
TargetSodium- and chloride-dependent glycine transporter 2(Homo sapiens (Human))
Organon Laboratories
Curated by ChEMBL
LigandPNGBDBM50102687(4-Butoxy-N-(1-dimethylamino-cyclopentylmethyl)-3,5...)
Affinity DataIC50:  77nM. Assay description: Inhibition of human Glycine Transporter type-2
In DepthDetails ArticlePubMed
TargetSodium- and chloride-dependent glycine transporter 1(Homo sapiens (Human))
Organon Laboratories
Curated by ChEMBL
LigandPNGBDBM50102687(4-Butoxy-N-(1-dimethylamino-cyclopentylmethyl)-3,5...)
Affinity DataIC50: >100nM. Assay description: In vitro inhibition of human Glycine Transporter type-1.
In DepthDetails ArticlePubMed