BDBM50102707 2-(6-{(2-Hydroxy-ethyl)-[2-(2-hydroxy-ethylamino)-ethyl]-amino}-9-methyl-9H-purin-2-ylamino)-acetamide(YTC25)::CHEMBL316097
SMILES Cn1cnc2c(nc(NCC(N)=O)nc12)N(CCO)CCNCCO
InChI Key InChIKey=RZOCBBRTKZOUHH-UHFFFAOYSA-N
Data  1 IC50
  Tab Delimited (TSV)   2D SDfile   Computed 3D by Vconf -m prep SDfile
Find this compound or compounds like it in BindingDB:
Activity Spreadsheet -- Enzyme Inhibition Constant Data from BindingDB
Found 1 hit for monomerid = 50102707
TargetSulfotransferase 1E1(Mus musculus)
University Of California
Curated by ChEMBL
LigandPNGBDBM50102707(2-(6-{(2-Hydroxy-ethyl)-[2-(2-hydroxy-ethylamino)-...)
Affinity DataIC50:  1.00E+5nM. Assay description: Inhibition of estrogen sulfotransferase (EST) in TLC radiolabel transfer assay
In DepthDetails ArticlePubMed