BDBM50102885 2,2,2-Trifluoro-N-(3,4,5-trihydroxy-6-hydroxymethyl-tetrahydro-pyran-2-yl)-acetamide::CHEMBL419523
SMILES OCC1O[C@@H](NC(=O)C(F)(F)F)C(O)[C@@H](O)[C@@H]1O
InChI Key InChIKey=XMUBEPVSEUVEBW-OOMLUFPTSA-N
Data  1 KI
  Tab Delimited (TSV)   2D SDfile   Computed 3D by Vconf -m prep SDfile
Find this compound or compounds like it in BindingDB:
Activity Spreadsheet -- Enzyme Inhibition Constant Data from BindingDB
Found 1 hit for monomerid = 50102885
TargetGlycogen phosphorylase, brain form(Homo sapiens (Human))
University Of Debrecen
Curated by ChEMBL
LigandPNGBDBM50102885(2,2,2-Trifluoro-N-(3,4,5-trihydroxy-6-hydroxymethy...)
Affinity DataKi:  7.10E+5nM. Assay description: Inhibitory activity against muscle Glycogen Phosphorylase b
In DepthDetails ArticlePubMed