BDBM50103062 CHEMBL304304::Phosphoric acid mono-(4-{(S)-2-acetylamino-2-[(R)-4-(2'-cyano-biphenyl-3-ylmethyl)-5-oxo-[1,4]thiazepan-6-ylcarbamoyl]-ethyl}-phenyl) ester
SMILES CC(=O)N[C@@H](Cc1ccc(OP(O)(O)=O)cc1)C(=O)N[C@H]1CSCCN(Cc2cccc(c2)-c2ccccc2C#N)C1=O
InChI Key InChIKey=ZPSWCSVTKIMSAW-NSOVKSMOSA-N
Data  1 IC50
  Tab Delimited (TSV)   2D SDfile   Computed 3D by Vconf -m prep SDfile
Find this compound or compounds like it in BindingDB:
Activity Spreadsheet -- Enzyme Inhibition Constant Data from BindingDB
Found 1 hit for monomerid = 50103062
TargetProto-oncogene tyrosine-protein kinase Src(Homo sapiens (Human))
Aventis
Curated by ChEMBL
LigandPNGBDBM50103062(CHEMBL304304 | Phosphoric acid mono-(4-{(S)-2-acet...)
Affinity DataIC50:  300nM. Assay description: Binding affinity was determined on Src protein tryrosine kinase SH2 domain using fluorescence polarization assay with 2% DMSO in buffer solution
In DepthDetails ArticlePubMed