BDBM50103118 CHEMBL66059::N,N-Dibenzyl-N'-[1-(5-chloro-thiophen-2-yl)-meth-(E)-ylidene]-hydrazine
SMILES Clc1ccc(\C=N\N(Cc2ccccc2)Cc2ccccc2)s1
InChI Key InChIKey=BIIFHIPNZHIUDL-FYJGNVAPSA-N
Data  1 IC50
  Tab Delimited (TSV)   2D SDfile   Computed 3D by Vconf -m prep SDfile
Find this compound or compounds like it in BindingDB:
Activity Spreadsheet -- Enzyme Inhibition Constant Data from BindingDB
Found 1 hit for monomerid = 50103118
TargetGlucose-6-phosphatase catalytic subunit 1(Homo sapiens (Human))
Novo Nordisk
Curated by ChEMBL
LigandPNGBDBM50103118(CHEMBL66059 | N,N-Dibenzyl-N'-[1-(5-chloro-thiophe...)
Affinity DataIC50:  170nM. Assay description: Compound was evaluated for inhibition of Glucose-6-Phosphatase from Triton X-100 disrupted pig liver microsomes.
In DepthDetails ArticlePubMed