BDBM50103124 CHEMBL67272::[5-(Dibenzyl-hydrazonomethyl)-furan-2-yl]-methanol
SMILES OCc1ccc(\C=N\N(Cc2ccccc2)Cc2ccccc2)o1
InChI Key InChIKey=LDUYSXZYHYVZPD-FYJGNVAPSA-N
Data  1 IC50
  Tab Delimited (TSV)   2D SDfile   Computed 3D by Vconf -m prep SDfile
Find this compound or compounds like it in BindingDB:
Activity Spreadsheet -- Enzyme Inhibition Constant Data from BindingDB
Found 1 hit for monomerid = 50103124
TargetGlucose-6-phosphatase catalytic subunit 1(Homo sapiens (Human))
Novo Nordisk
Curated by ChEMBL
LigandPNGBDBM50103124(CHEMBL67272 | [5-(Dibenzyl-hydrazonomethyl)-furan-...)
Affinity DataIC50:  1.60E+4nM. Assay description: Compound was evaluated for inhibition of Glucose-6-Phosphatase from Triton X-100 disrupted pig liver microsomes.
In DepthDetails ArticlePubMed