BDBM50103231 CHEMBL98615::Naphthalene-2,7-dicarboxylic acid
SMILES OC(=O)c1ccc2ccc(cc2c1)C(O)=O
InChI Key InChIKey=WPUMVKJOWWJPRK-UHFFFAOYSA-N
Data  1 KI
  Tab Delimited (TSV)   2D SDfile   Computed 3D by Vconf -m prep SDfile
Find this compound or compounds like it in BindingDB:
Activity Spreadsheet -- Enzyme Inhibition Constant Data from BindingDB
Found 1 hit for monomerid = 50103231
TargetTyrosine-protein phosphatase non-receptor type 1(Homo sapiens (Human))
National Cancer Institute-Frederick
Curated by ChEMBL
LigandPNGBDBM50103231(CHEMBL98615 | Naphthalene-2,7-dicarboxylic acid)
Affinity DataKi: >3.20E+6nM. Assay description: Inhibitory activity against human Protein-tyrosinephosphatase 1B (PTP1B)
In DepthDetails ArticlePubMed