BDBM50103359 4-(5-{[1-(Pyridine-3-carbonyl)-pyrrolidin-3-ylamino]-methyl}-imidazol-1-ylmethyl)-benzonitrile::CHEMBL99650
SMILES O=C(N1CC[C@@H](C1)NCc1cncn1Cc1ccc(cc1)C#N)c1cccnc1
InChI Key InChIKey=XNQGRIJQRDBCBM-FQEVSTJZSA-N
Data  2 IC50
  Tab Delimited (TSV)   2D SDfile   Computed 3D by Vconf -m prep SDfile
Find this compound or compounds like it in BindingDB:
Activity Spreadsheet -- Enzyme Inhibition Constant Data from BindingDB
Found 2 hits for monomerid = 50103359
TargetDimer of Protein farnesyltransferase subunit beta(Homo sapiens (Human))
Merck Research Laboratories
Curated by ChEMBL
LigandPNGBDBM50103359(4-(5-{[1-(Pyridine-3-carbonyl)-pyrrolidin-3-ylamin...)
Affinity DataIC50:  2.00E+3nM. Assay description: In vitro inhibition of farnesyl transferase using purified recombinant human enzyme
In DepthDetails ArticlePubMed
TargetGeranylgeranyl transferase type-1 subunit beta(Homo sapiens (Human))
Merck Research Laboratories
Curated by ChEMBL
LigandPNGBDBM50103359(4-(5-{[1-(Pyridine-3-carbonyl)-pyrrolidin-3-ylamin...)
Affinity DataIC50: >5.00E+4nM. Assay description: Inhibitory concentration of geranylgeranyl-protein transferase type I
In DepthDetails ArticlePubMed