BDBM50103393 CHEMBL3398231
SMILES OC(=O)COc1cccc2CC(Cn3ncc(-c4ccccc4)c(-c4cccc(F)c4)c3=O)CCc12
InChI Key InChIKey=HBVBWRXJRMIUKM-UHFFFAOYSA-N
Data  2 EC50
  Tab Delimited (TSV)   2D SDfile   Computed 3D by Vconf -m prep SDfile
Find this compound or compounds like it in BindingDB:
Activity Spreadsheet -- Enzyme Inhibition Constant Data from BindingDB
Found 2 hits for monomerid = 50103393
TargetProstacyclin receptor(RAT)
Arena Pharmaceuticals
Curated by ChEMBL
LigandPNGBDBM50103393(CHEMBL3398231)
Affinity DataEC50:  790nM. Assay description: Agonist activity at rat recombinant IP receptor expressed in CHO-K1 cells incubated for 1 hr by HTRF cAMP assay
In DepthDetails ArticlePubMed
TargetProstacyclin receptor(Homo sapiens (Human))
Arena Pharmaceuticals
Curated by ChEMBL
LigandPNGBDBM50103393(CHEMBL3398231)
Affinity DataEC50:  260nM. Assay description: Agonist activity at human recombinant IP receptor expressed in CHO-K1 cells incubated for 1 hr by HTRF cAMP assay
In DepthDetails ArticlePubMed