BDBM50103443 CHEMBL3398245
SMILES Cl.Nc1cccc2SSSSSc12
InChI Key InChIKey=LVDPHZGWBBUPCT-UHFFFAOYSA-N
Data  1 KI  2 IC50
  Tab Delimited (TSV)   2D SDfile   Computed 3D by Vconf -m prep SDfile
Find this compound or compounds like it in BindingDB:
Activity Spreadsheet -- Enzyme Inhibition Constant Data from BindingDB
Found 3 hits for monomerid = 50103443
TargetTyrosine-protein phosphatase non-receptor type 5(Homo sapiens (Human))
Yale University
Curated by ChEMBL
LigandPNGBDBM50103443(CHEMBL3398245)
Affinity DataKi:  183nM. Assay description: Inhibition of STEP (unknown origin) in absence of GSH by p-nitrophenyl phosphate hydrolysis assay
In DepthDetails ArticlePubMed
TargetTyrosine-protein phosphatase non-receptor type 5(Homo sapiens (Human))
Yale University
Curated by ChEMBL
LigandPNGBDBM50103443(CHEMBL3398245)
Affinity DataIC50:  32nM. Assay description: Inhibition of STEP (unknown origin) pre-incubated for 10 mins before addition of p-nitrophenyl phosphate substrate in absence of GSH
In DepthDetails ArticlePubMed
TargetTyrosine-protein phosphatase non-receptor type 5(Homo sapiens (Human))
Yale University
Curated by ChEMBL
LigandPNGBDBM50103443(CHEMBL3398245)
Affinity DataIC50:  3.30E+4nM. Assay description: Inhibition of STEP (unknown origin) pre-incubated for 10 mins before addition of p-nitrophenyl phosphate substrate in presence of 1 mM GSH
In DepthDetails ArticlePubMed