BDBM50103825 (3-Hydroxy-4-methoxy-phenyl)-[2-(3,4,5-trimethoxy-phenyl)-thiophen-3-yl]-methanone::CHEMBL306514
SMILES COc1ccc(cc1O)C(=O)c1ccsc1-c1cc(OC)c(OC)c(OC)c1
InChI Key InChIKey=NLLGQHSWAVVWME-UHFFFAOYSA-N
Data  1 IC50
  Tab Delimited (TSV)   2D SDfile   Computed 3D by Vconf -m prep SDfile
Find this compound or compounds like it in BindingDB:
Activity Spreadsheet -- Enzyme Inhibition Constant Data from BindingDB
Found 1 hit for monomerid = 50103825
TargetTubulin alpha-1A chain(Sus scrofa (Pig))
Australian National University
Curated by ChEMBL
LigandPNGBDBM50103825((3-Hydroxy-4-methoxy-phenyl)-[2-(3,4,5-trimethoxy-...)
Affinity DataIC50: >4.00E+4nM. Assay description: Compound was evaluated for inhibition of tubulin polymerization
In DepthDetails ArticlePubMed