BDBM50104047 (E)-N-[3-Benzoyl-4-(2-p-tolyl-acetylamino)-phenyl]-3-[5-(4-nitro-phenyl)-furan-2-yl]-acrylamide::CHEMBL67122::N-(3-benzoyl-4-(2-p-tolylacetamido)phenyl)-3-(5-(4-nitrophenyl)furan-2-yl)acrylamide::N-[3-Benzoyl-4-(2-p-tolyl-acetylamino)-phenyl]-3-[(E)-5-(4-nitro-phenyl)-furan-2-yl]-acrylamide::N-[3-Benzoyl-4-(2-p-tolyl-acetylamino)-phenyl]-3-[5-(4-nitro-phenyl)-furan-2-yl]-acrylamide
SMILES Cc1ccc(CC(=O)Nc2ccc(NC(=O)\C=C\c3ccc(o3)-c3ccc(cc3)[N+]([O-])=O)cc2C(=O)c2ccccc2)cc1
InChI Key InChIKey=ZTORJVQLJHBZSP-LVZFUZTISA-N
Data  1 IC50
  Tab Delimited (TSV)   2D SDfile   Computed 3D by Vconf -m prep SDfile
Find this compound or compounds like it in BindingDB:
Activity Spreadsheet -- Enzyme Inhibition Constant Data from BindingDB
Found 1 hit for monomerid = 50104047
TargetProtein farnesyltransferase subunit beta/geranylgeranyltransferase type-1 subunit alpha(Saccharomyces cerevisiae (Baker's yeast))
Philipps-UniversitäT Marburg
Curated by ChEMBL
LigandPNGBDBM50104047((E)-N-[3-Benzoyl-4-(2-p-tolyl-acetylamino)-phenyl]...)
Affinity DataIC50:  35nM. Assay description: Inhibitory activity against yeast farnesyltransferase
In DepthDetails ArticlePubMed