BDBM50104056 CHEMBL90987::N-[3-Benzoyl-4-(2-p-tolyl-acetylamino)-phenyl]-3-[5-(4-chloro-phenyl)-furan-2-yl]-acrylamide
SMILES Cc1ccc(CC(=O)Nc2ccc(NC(=O)\C=C\c3ccc(o3)-c3ccc(Cl)cc3)cc2C(=O)c2ccccc2)cc1
InChI Key InChIKey=FSQQHANFYRTQLZ-LVZFUZTISA-N
Data  1 IC50
  Tab Delimited (TSV)   2D SDfile   Computed 3D by Vconf -m prep SDfile
Find this compound or compounds like it in BindingDB:
Activity Spreadsheet -- Enzyme Inhibition Constant Data from BindingDB
Found 1 hit for monomerid = 50104056
TargetProtein farnesyltransferase subunit beta/geranylgeranyltransferase type-1 subunit alpha(Saccharomyces cerevisiae (Baker's yeast))
Philipps-UniversitäT Marburg
Curated by ChEMBL
LigandPNGBDBM50104056(CHEMBL90987 | N-[3-Benzoyl-4-(2-p-tolyl-acetylamin...)
Affinity DataIC50:  6.30E+3nM. Assay description: Inhibitory activity against yeast farnesyltransferase
In DepthDetails ArticlePubMed