BDBM50104153 CHEMBL3594235
SMILES [H][C@@]12C[C@@H](C[C@]1([H])CN(C2)c1nc(OC)cc(n1)C(O)=O)c1ccccc1C(F)(F)F
InChI Key InChIKey=BPXOORUEPPGPFJ-XYYAHUGASA-N
Data  2 IC50
  Tab Delimited (TSV)   2D SDfile   Computed 3D by Vconf -m prep SDfile
Find this compound or compounds like it in BindingDB:
Activity Spreadsheet -- Enzyme Inhibition Constant Data from BindingDB
Found 2 hits for monomerid = 50104153
TargetRetinol-binding protein 4(Homo sapiens (Human))
Columbia University Medical Center
Curated by ChEMBL
LigandPNGBDBM50104153(CHEMBL3594235)
Affinity DataIC50:  81nM. Assay description: Inhibition of retinol-induced interaction of bacterially expressed MBP-tagged RBP4 (unknown origin) with Eu3+ cryptate labeled TTR by HTRF assay
In DepthDetails ArticlePubMed
TargetRetinol-binding protein 4(Homo sapiens (Human))
Columbia University Medical Center
Curated by ChEMBL
LigandPNGBDBM50104153(CHEMBL3594235)
Affinity DataIC50:  13nM. Assay description: Displacement of [3H]-retinol from RBP4 (unknown origin) by scintillation proximity assay
In DepthDetails ArticlePubMed