BDBM50104159 CHEMBL3594229::US10787453, Compound 66
SMILES [H][C@@]12CN(C[C@]1([H])CN(C2)c1ccccc1C(F)(F)F)c1nc(C)cc(n1)C(=O)OC
InChI Key InChIKey=ZCCYWMHVJGKRJT-OKILXGFUSA-N
Data  3 IC50
  Tab Delimited (TSV)   2D SDfile   Computed 3D by Vconf -m prep SDfile
Find this compound or compounds like it in BindingDB:
Activity Spreadsheet -- Enzyme Inhibition Constant Data from BindingDB
Found 3 hits for monomerid = 50104159
TargetRetinol-binding protein 4(Homo sapiens (Human))
Columbia University Medical Center
Curated by ChEMBL
LigandPNGBDBM50104159(CHEMBL3594229 | US10787453, Compound 66)
Affinity DataIC50:  3.90nM. Assay description: Displacement of [3H]-retinol from RBP4 (unknown origin) by scintillation proximity assay
In DepthDetails ArticlePubMed
TargetRetinol-binding protein 4(Homo sapiens (Human))
Columbia University Medical Center
Curated by ChEMBL
LigandPNGBDBM50104159(CHEMBL3594229 | US10787453, Compound 66)
Affinity DataIC50:  3.90nM. Assay description: Compound 65 and 66 were tested in two in vitro assays, RBP4 binding (SPA) and retinol-dependent RBP4-TTR interaction (HTRF). The compounds binded to ...
In DepthDetails US Patent
TargetRetinol-binding protein 4(Homo sapiens (Human))
Columbia University Medical Center
Curated by ChEMBL
LigandPNGBDBM50104159(CHEMBL3594229 | US10787453, Compound 66)
Affinity DataIC50:  74nM. Assay description: Inhibition of retinol-induced interaction of bacterially expressed MBP-tagged RBP4 (unknown origin) with Eu3+ cryptate labeled TTR by HTRF assay
In DepthDetails ArticlePubMed